Target
Receptor-type tyrosine-protein phosphatase epsilon
Ligand
BDBM50087856
Substrate
Meas. Tech.
ChEMBL_1476074 (CHEMBL3428704)
pH
7±n/a
IC50
>50000±n/a nM
Comments
extracted
Citation
 He, YGuo, XYu, ZHWu, LGunawan, AMZhang, YDixon, JEZhang, ZY A potent and selective inhibitor for the UBLCP1 proteasome phosphatase. Bioorg Med Chem 23:2798-809 (2015)  
Target
Name:
Receptor-type tyrosine-protein phosphatase epsilon
Synonyms:
PTPRE Protein-tyrosine phosphatase epsilon Receptor-type tyrosine-protein phosphatase epsilon (PTPε)
Type:
Protein
Mol. Mass.:
80646.31
Organism:
Homo sapiens (Human)
Description:
P23469
Residue:
700
  
Inhibitor
Name:
BDBM50087856
Synonyms:
CHEMBL3426913
Type:
Small organic molecule
Emp. Form.:
C28H30F3NO6
Mol. Mass.:
533.5361
SMILES:
CCCCC(Oc1cc(O)c(cc1C#Cc1ccccc1OC(F)(F)F)C(O)=O)C(=O)NC1CCCCC1
: