Target
Ubiquitin-like domain-containing CTD phosphatase 1
Ligand
BDBM50087856
Substrate
Meas. Tech.
ChEMBL_1476058 (CHEMBL3428554)
pH
6±n/a
IC50
500±n/a nM
Comments
extracted
Citation
 He, YGuo, XYu, ZHWu, LGunawan, AMZhang, YDixon, JEZhang, ZY A potent and selective inhibitor for the UBLCP1 proteasome phosphatase. Bioorg Med Chem 23:2798-809 (2015)  
Target
Name:
Ubiquitin-like domain-containing CTD phosphatase 1
Synonyms:
Nuclear proteasome inhibitor UBLCP1 UBLCP1 | Ubiquitin-like domain-containing CTD phosphatase 1
Type:
Enzyme
Mol. Mass.:
36803.71
Organism:
Homo sapiens (Human)
Description:
Q8WVY7
Residue:
318
  
Inhibitor
Name:
BDBM50087856
Synonyms:
CHEMBL3426913
Type:
Small organic molecule
Emp. Form.:
C28H30F3NO6
Mol. Mass.:
533.5361
SMILES:
CCCCC(Oc1cc(O)c(cc1C#Cc1ccccc1OC(F)(F)F)C(O)=O)C(=O)NC1CCCCC1
: