Target
Ephrin type-B receptor 2
Ligand
BDBM50331095
Substrate
Meas. Tech.
ChEMBL_1476221 (CHEMBL3429407)
IC50
18±n/a nM
Citation
 Guo, SPang, XPeng, LZhan, MFan, LGong, YKang, FChen, Y Design, synthesis and biological evaluation of deuterated Tivozanib for improving pharmacokinetic properties. Bioorg Med Chem Lett 25:2425-8 (2015)  
Target
Name:
Ephrin type-B receptor 2
Synonyms:
DRT ELK-related tyrosine kinase EPH-like kinase 5 EPHB2_HUMAN EPTH3 Ephrin receptor TYRO5
Type:
PROTEIN
Mol. Mass.:
117491.44
Organism:
Homo sapiens (Human)
Description:
ChEMBL_1476221
Residue:
1055
  
Inhibitor
Name:
BDBM50331095
Synonyms:
CHEMBL1289494 US10464902, Tivozanib
Type:
Small organic molecule
Emp. Form.:
C22H19ClN4O5
Mol. Mass.:
454.863
SMILES:
COc1cc2nccc(Oc3ccc(NC(=O)Nc4cc(C)on4)c(Cl)c3)c2cc1OC
: