Target
Tyrosine-protein phosphatase non-receptor type 2
Ligand
BDBM82577
Substrate
Meas. Tech.
ChEMBL_1476404 (CHEMBL3430034)
IC50
55000±n/a nM
Citation
 Tautz, LSenis, YAOury, CRahmouni, S Perspective: Tyrosine phosphatases as novel targets for antiplatelet therapy. Bioorg Med Chem 23:2786-97 (2015)  
Target
Name:
Tyrosine-protein phosphatase non-receptor type 2
Synonyms:
PTN2_HUMAN PTPT T-cell protein-tyrosine phosphatase TCPTP Tyrosine-protein phosphatase non-receptor type 2 (TC-PTP)
Type:
Protein
Mol. Mass.:
48481.80
Organism:
Homo sapiens (Human)
Description:
P17706
Residue:
415
  
Inhibitor
Name:
BDBM82577
Synonyms:
(4-fluoro-1,3-benzothiazol-2-yl)-[5-(4-methoxyphenyl)-1,3,4-oxadiazol-2-yl]amine N-(4-fluoranyl-1,3-benzothiazol-2-yl)-5-(4-methoxyphenyl)-1,3,4-oxadiazol-2-amine cid_7158830
Type:
Small organic molecule
Emp. Form.:
C16H11FN4O2S
Mol. Mass.:
342.348
SMILES:
COc1ccc(cc1)-c1nnc(Nc2nc3c(F)cccc3s2)o1
: