Target
Potassium voltage-gated channel subfamily D member 3
Ligand
BDBM25351
Substrate
Meas. Tech.
ChEMBL_1478657 (CHEMBL3430558)
IC50
5011872±n/a nM
Citation
 Mirams, GRDavies, MRBrough, SJBridgland-Taylor, MHCui, YGavaghan, DJAbi-Gerges, N Prediction of Thorough QT study results using action potential simulations based on ion channel screens. J Pharmacol Toxicol Methods 70:246-54 (2014)  
Target
Name:
Potassium voltage-gated channel subfamily D member 3
Synonyms:
KCND3 Kv channel-interacting protein 2/Potassium voltage-gated channel subfamily D member 3 Voltage-gated potassium channel | Voltage-gated potassium channel subunit Kv4.3
Type:
PROTEIN
Mol. Mass.:
73464.62
Organism:
Homo sapiens (Human)
Description:
ChEMBL_1478652
Residue:
655
  
Inhibitor
Name:
BDBM25351
Synonyms:
N-[2-(4-{[(4-fluorophenyl)methyl]carbamoyl}-5-hydroxy-1-methyl-6-oxo-1,6-dihydropyrimidin-2-yl)propan-2-yl]-5-methyl-1,3,4-oxadiazole-2-carboxamide | Raltegravir
Type:
Small organic molecule
Emp. Form.:
C20H21FN6O5
Mol. Mass.:
444.4163
SMILES:
Cc1nnc(o1)C(=O)NC(C)(C)c1nc(C(=O)NCc2ccc(F)cc2)c(O)c(=O)n1C
: