Target
Voltage-dependent L-type calcium channel subunit alpha-1C
Ligand
BDBM25762
Substrate
Meas. Tech.
ChEMBL_1479159 (CHEMBL3436135)
IC50
1023000±n/a nM
Citation
 Wisniowska, BMendyk, AFijorek, KGlinka, APolak, S Predictive model for L-type channel inhibition: multichannel block in QT prolongation risk assessment. J Appl Toxicol 32:858-66 (2012)  
Target
Name:
Voltage-dependent L-type calcium channel subunit alpha-1C
Synonyms:
CAC1C_HUMAN CACN2 CACNL1A1 Calcium channel (Type L) L-type calcium channel alpha-1c/beta-2/alpha2delta-1 Voltage-gated L-type calcium channel Voltage-gated calcium channel | Voltage-gated calcium channel subunit alpha Cav1.2
Type:
Enzyme Catalytic Domain
Mol. Mass.:
248979.79
Organism:
Homo sapiens (Human)
Description:
Calcium channel (Type L) 0 HUMAN::Q13936
Residue:
2221
  
Inhibitor
Name:
BDBM25762
Synonyms:
CHEMBL471 SOTALOL HYDROCHLORIDE Sotalol,(+) cid_66245
Type:
Small organic molecule
Emp. Form.:
C12H20N2O3S
Mol. Mass.:
272.364
SMILES:
CC(C)NCC(O)c1ccc(NS(C)(=O)=O)cc1
: