Target
Nuclear receptor subfamily 1 group I member 2
Ligand
BDBM50301375
Substrate
Meas. Tech.
ChEMBL_1487565 (CHEMBL3531532)
EC50
100000±n/a nM
Citation
 Shukla, SJSakamuru, SHuang, RMoeller, TAShinn, PVanleer, DAuld, DSAustin, CPXia, M Identification of clinically used drugs that activate pregnane X receptors. Drug Metab Dispos 39:151-9 (2010)  
Target
Name:
Nuclear receptor subfamily 1 group I member 2
Synonyms:
NR1I2 Orphan nuclear receptor PAR1 PXR SXR nuclear receptor subfamily 1 group I member 2 isoform 1
Type:
Nuclear receptor
Mol. Mass.:
49774.77
Organism:
Homo sapiens (Human)
Description:
O75469
Residue:
434
  
Inhibitor
Name:
BDBM50301375
Synonyms:
3,3',5,5'-tetraiodo-L-thyronine 4-(4-hydroxy-3,5-diiodophenoxy)-3,5-diiodo-L-phenylalanine L-T4 O-(4-hydroxy-3,5-diiodophenyl)-3,5-diiodo-L-tyrosine | levothyroxine
Type:
Small organic molecule
Emp. Form.:
C15H11I4NO4
Mol. Mass.:
776.87
SMILES:
N[C@@H](Cc1cc(I)c(Oc2cc(I)c(O)c(I)c2)c(I)c1)C(O)=O
: