Target
Liver carboxylesterase 1
Ligand
BDBM50003616
Substrate
Meas. Tech.
ChEMBL_1494239 (CHEMBL3530687)
Ki
363000±n/a nM
Citation
 Inoue, NRHall, ALai, WGWilliams, ET Reversible inhibition of human carboxylesterases by acyl glucuronides. Drug Metab Dispos 41:698-703 (2013)  
Target
Name:
Liver carboxylesterase 1
Synonyms:
Acyl coenzyme A:cholesterol acyltransferase CES1 EST1_HUMAN Serine hydrolase (CES1)
Type:
Protein
Mol. Mass.:
62520.83
Organism:
Homo sapiens (Human)
Description:
Residue:
567
  
Inhibitor
Name:
BDBM50003616
Synonyms:
2-n-propyl-n-valeric acid DPA VALPROIC ACID dipropylacetic acid | n-DPA
Type:
Small organic molecule
Emp. Form.:
C8H16O2
Mol. Mass.:
144.2114
SMILES:
CCCC(CCC)C(O)=O
: