Target
UDP-glucuronosyltransferase 2B7
Ligand
BDBM50002692
Substrate
Meas. Tech.
ChEMBL_1488942 (CHEMBL3535608)
Ki
200000±n/a nM
Citation
 Dostalek, MCourt, MHHazarika, SAkhlaghi, F Diabetes mellitus reduces activity of human UDP-glucuronosyltransferase 2B7 in liver and kidney leading to decreased formation of mycophenolic acid acyl-glucuronide metabolite. Drug Metab Dispos 39:448-55 (2011)  
Target
Name:
UDP-glucuronosyltransferase 2B7
Synonyms:
2.4.1.17 UD2B7_HUMAN UDP-glucuronosyltransferase 2B9 UDPGT 2B9 UGT2B7 Uridine-5'-diphosphoglucuronosyltransferase 2B7
Type:
Enzyme
Mol. Mass.:
60705.98
Organism:
Homo sapiens (Human)
Description:
P16662
Residue:
529
  
Inhibitor
Name:
BDBM50002692
Synonyms:
(AZT) 1-(4-Azido-5-hydroxymethyl-tetrahydro-furan-2-yl)-5-methyl-1H-pyrimidine-2,4-dione 1-((2R,4R,5S)-4-azido-5-(hydroxymethyl)tetrahydrofuran-2-yl)-5-methylpyrimidine-2,4(1H,3H)-dione 1-((2R,4S,5S)-4-Azido-5-hydroxymethyl-tetrahydro-furan-2-yl)-5-methyl-1H-pyrimidine-2,4-dione 1-((2R,4S,5S)-4-azido-5-(hydroxymethyl)tetrahydrofuran-2-yl)-5-methylpyrimidine-2,4(1H,3H)-dione 1-((2S,4R,5R)-4-Azido-5-hydroxymethyl-tetrahydro-furan-2-yl)-5-methyl-1H-pyrimidine-2,4-dione 1-(4-Azido-5-hydroxymethyl-tetrahydro-furan-2-yl)-5-methyl-1H-pyrimidine-2,4-dione (AZT) 1-(4-Azido-5-hydroxymethyl-tetrahydro-furan-2-yl)-5-methyl-1H-pyrimidine-2,4-dione (N3ddThd) 1-(4-Azido-5-hydroxymethyl-tetrahydro-furan-2-yl)-5-methyl-1H-pyrimidine-2,4-dione(3'-azido-2',3'-dideoxythymidine) 1-(4-Azido-5-hydroxymethyl-tetrahydro-furan-2-yl)-5-methyl-1H-pyrimidine-2,4-dione(Zidovudine, AZT) 3'-Azido-3'-deoxy-thymidine 3'-azido-2',3'-dideoxythymidine 3'azido-2'3'-dideoxythymidine 4-(4-Azido-5-hydroxy-tetrahydro-furan-2-yl)-5-methyl-3H-pyrazine-2,6-dione BW-A-509U CHEMBL129 US10071110, Compound AZT ZIDOVUDINE zidovudin | zudovidine
Type:
Small organic molecule
Emp. Form.:
C10H13N5O4
Mol. Mass.:
267.2413
SMILES:
Cc1cn([C@H]2C[C@H](N=[N+]=[N-])[C@@H](CO)O2)c(=O)[nH]c1=O
: