Target
Protein arginine N-methyltransferase 7
Ligand
BDBM50089221
Substrate
Meas. Tech.
ChEMBL_1496156 (CHEMBL3578937)
Kd
37000±n/a nM
Citation
 Smil, DEram, MSLi, FKennedy, SSzewczyk, MMBrown, PJBarsyte-Lovejoy, DArrowsmith, CHVedadi, MSchapira, M Discovery of a Dual PRMT5-PRMT7 Inhibitor. ACS Med Chem Lett 6:408-12 (2015)  
Target
Name:
Protein arginine N-methyltransferase 7
Synonyms:
ANM7_HUMAN KIAA1933 Protein arginine N-methyltransferase 7 [Myelin basic protein]-arginine N-methyltransferase PRMT7
Type:
Enzyme
Mol. Mass.:
78440.77
Organism:
Homo sapiens (Human)
Description:
Q9NVM4
Residue:
692
  
Inhibitor
Name:
BDBM50089221
Synonyms:
CHEMBL3577854
Type:
Small organic molecule
Emp. Form.:
C15H23N7O4S
Mol. Mass.:
397.453
SMILES:
CCNC(=O)NCCSC[C@H]1O[C@H]([C@H](O)[C@@H]1O)n1cnc2c(N)ncnc12
: