Target
Macrophage-stimulating protein receptor
Ligand
BDBM50090968
Substrate
Meas. Tech.
ChEMBL_1499715 (CHEMBL3585031)
IC50
17±n/a nM
Citation
 Raeppel, SLRaeppel, FTherrien, E Design and synthesis of close analogs of LCRF-0004, a potent and selective RON receptor tyrosine kinase inhibitor. Bioorg Med Chem Lett 25:2527-31 (2015)  
Target
Name:
Macrophage-stimulating protein receptor
Synonyms:
2.7.10.1 CDw136 MST1R Macrophage-stimulating protein receptor alpha chain PTK8 RON Tyrosine kinase receptor ron | p185-Ron
Type:
Protein
Mol. Mass.:
152270.76
Organism:
Homo sapiens (Human)
Description:
Q04912
Residue:
1400
  
Inhibitor
Name:
BDBM50090968
Synonyms:
CHEMBL3582035
Type:
Small organic molecule
Emp. Form.:
C27H17F4N7O2S
Mol. Mass.:
579.528
SMILES:
Cn1cnc(c1)-c1cc2nccc(Oc3ccc(NC(=O)c4nnn(c4C(F)(F)F)-c4ccccc4)cc3F)c2s1
: