Target
Bromodomain-containing protein 3
Ligand
BDBM50092310
Substrate
Meas. Tech.
ChEMBL_1498189 (CHEMBL3583409)
Kd
18±n/a nM
Citation
 Ran, XZhao, YLiu, LBai, LYang, CYZhou, BMeagher, JLChinnaswamy, KStuckey, JAWang, S Structure-Based Design of¿-Carboline Analogues as Potent and Specific BET Bromodomain Inhibitors. J Med Chem 58:4927-39 (2015)  
Target
Name:
Bromodomain-containing protein 3
Synonyms:
BRD3 Bromodomain and extra-terminal motif (BET) Bromodomain-containing protein 3 (BRD3) RING3-like protein | RING3L
Type:
Protein
Mol. Mass.:
79571.81
Organism:
Homo sapiens (Human)
Description:
Q15059
Residue:
726
  
Inhibitor
Name:
BDBM50092310
Synonyms:
CHEMBL3581661 | US9675697, Cpd. No. 23
Type:
Small organic molecule
Emp. Form.:
C24H23N5O2
Mol. Mass.:
413.4717
SMILES:
COc1cc2c(cc1-c1c(C)noc1C)[nH]c1ccnc(-c3c(C)[nH]nc3C3CC3)c21
: