Target
Bromodomain-containing protein 3
Ligand
BDBM50092311
Substrate
Meas. Tech.
ChEMBL_1498014 (CHEMBL3585075)
Ki
10±n/a nM
Citation
 Ran, XZhao, YLiu, LBai, LYang, CYZhou, BMeagher, JLChinnaswamy, KStuckey, JAWang, S Structure-Based Design of¿-Carboline Analogues as Potent and Specific BET Bromodomain Inhibitors. J Med Chem 58:4927-39 (2015)  
Target
Name:
Bromodomain-containing protein 3
Synonyms:
BRD3 Bromodomain and extra-terminal motif (BET) Bromodomain-containing protein 3 (BRD3) RING3-like protein | RING3L
Type:
Protein
Mol. Mass.:
79571.81
Organism:
Homo sapiens (Human)
Description:
Q15059
Residue:
726
  
Inhibitor
Name:
BDBM50092311
Synonyms:
CHEMBL3581662
Type:
Small organic molecule
Emp. Form.:
C28H25N5O2
Mol. Mass.:
463.5304
SMILES:
CCc1[nH]nc(c1-c1nccc2[nH]c3cc(-c4c(C)noc4C)c(OC)cc3c12)-c1ccccc1
: