Target
Galectin-3
Ligand
BDBM50370453
Substrate
Meas. Tech.
ChEMBL_1503898 (CHEMBL3593131)
Kd
92600±n/a nM
Citation
 Marchiori, MFSouto, DEBortot, LOPereira, JFKubota, LTCummings, RDDias-Baruffi, MCarvalho, ICampo, VL Synthetic 1,2,3-triazole-linked glycoconjugates bind with high affinity to human galectin-3. Bioorg Med Chem 23:3414-25 (2015)  
Target
Name:
Galectin-3
Synonyms:
LEG3_HUMAN MAC2
Type:
Enzyme
Mol. Mass.:
26156.54
Organism:
Homo sapiens (Human)
Description:
P17931
Residue:
250
  
Inhibitor
Name:
BDBM50370453
Synonyms:
LACTOSE | Lactose, anhydrous
Type:
Small organic molecule
Emp. Form.:
C12H22O11
Mol. Mass.:
342.2965
SMILES:
OC[C@H]1O[C@@H](O[C@H]2[C@H](O)[C@@H](O)[C@H](O)O[C@@H]2CO)[C@H](O)[C@@H](O)[C@H]1O
: