Target
Catenin beta-1
Ligand
BDBM50094484
Substrate
Meas. Tech.
ChEMBL_1504364 (CHEMBL3592701)
IC50
150000±n/a nM
Citation
 Catrow, JLZhang, YZhang, MJi, H Discovery of Selective Small-Molecule Inhibitors for the฿-Catenin/T-Cell Factor Protein-Protein Interaction through the Optimization of the Acyl Hydrazone Moiety. J Med Chem 58:4678-92 (2015)  
Target
Name:
Catenin beta-1
Synonyms:
CTNB1_HUMAN CTNNB1
Type:
PROTEIN
Mol. Mass.:
85484.08
Organism:
Homo sapiens (Human)
Description:
ChEMBL_1504364
Residue:
781
  
Inhibitor
Name:
BDBM50094484
Synonyms:
CHEBI:3556 US9284299, CGP049090 | US9738628, Compound CGP049090
Type:
Small organic molecule
Emp. Form.:
C29H26O10
Mol. Mass.:
534.5107
SMILES:
COc1c(C[C@H](C)O)c2c3c(C[C@H](C)O)c(OC)c(=O)c4c(O)cc5OCOc6cc(O)c(c2c6c5c34)c1=O
: