Target
Voltage-dependent T-type calcium channel subunit alpha-1H
Ligand
BDBM50095308
Substrate
Meas. Tech.
ChEMBL_1503790 (CHEMBL3592671)
IC50
19000±n/a nM
Citation
 Zhang, QXia, ZJoshi, SScott, VEJarvis, MF Optimization of ADME Properties for Sulfonamides Leading to the Discovery of a T-Type Calcium Channel Blocker, ABT-639. ACS Med Chem Lett 6:641-4 (2015)  
Target
Name:
Voltage-dependent T-type calcium channel subunit alpha-1H
Synonyms:
CAC1H_HUMAN Low-voltage-activated calcium channel alpha1 3.2 subunit Voltage-gated calcium channel voltage-dependent T-type calcium channel subunit alpha-1H isoform a
Type:
Enzyme Catalytic Domain
Mol. Mass.:
259187.68
Organism:
Homo sapiens (Human)
Description:
Calcium channel (Type T,L) 0 0::O95180
Residue:
2353
  
Inhibitor
Name:
BDBM50095308
Synonyms:
CHEMBL3589554
Type:
Small organic molecule
Emp. Form.:
C20H20Cl2FN3O3S
Mol. Mass.:
472.361
SMILES:
[H][C@]12CCCN1CCN(C2)C(=O)c1cc(c(Cl)cc1Cl)S(=O)(=O)Nc1ccccc1F
: