Target
Voltage-dependent L-type calcium channel subunit alpha-1C/alpha-1D/alpha-1F/alpha-1S
Ligand
BDBM50095309
Substrate
Meas. Tech.
ChEMBL_1503813 (CHEMBL3592797)
IC50
>10000±n/a nM
Citation
 Zhang, QXia, ZJoshi, SScott, VEJarvis, MF Optimization of ADME Properties for Sulfonamides Leading to the Discovery of a T-Type Calcium Channel Blocker, ABT-639. ACS Med Chem Lett 6:641-4 (2015)  
Target
Name:
Voltage-dependent L-type calcium channel subunit alpha-1C/alpha-1D/alpha-1F/alpha-1S
Synonyms:
Voltage-gated L-type calcium channel
Type:
Mol. Mass.:
Description:
ASSAY_ID of ChEMBL is 92767
Components:
This complex has 4 components.
Component 1
Name:
Voltage-dependent L-type calcium channel subunit alpha-1D
Synonyms:
CAC1D_HUMAN CACN4 CACNL1A2 Calcium channel, L type, alpha-1 polypeptide, isoform 2 Voltage-gated L-type calcium channel Voltage-gated calcium channel | Voltage-gated calcium channel subunit alpha Cav1.3
Type:
PROTEIN
Mol. Mass.:
245144.84
Organism:
Homo sapiens (Human)
Description:
ChEMBL_1350501
Residue:
2161
  
Component 2
Name:
Voltage-dependent L-type calcium channel subunit alpha-1C
Synonyms:
CAC1C_HUMAN CACN2 CACNL1A1 Calcium channel (Type L) L-type calcium channel alpha-1c/beta-2/alpha2delta-1 Voltage-gated L-type calcium channel Voltage-gated calcium channel | Voltage-gated calcium channel subunit alpha Cav1.2
Type:
Enzyme Catalytic Domain
Mol. Mass.:
248979.79
Organism:
Homo sapiens (Human)
Description:
Calcium channel (Type L) 0 HUMAN::Q13936
Residue:
2221
  
Component 3
Name:
Voltage-dependent L-type calcium channel subunit alpha-1S
Synonyms:
CAC1S_HUMAN CACN1 CACNL1A3 Voltage-dependent L-type calcium channel subunit alpha-1S Voltage-gated L-type calcium channel alpha-1S subunit Voltage-gated calcium channel subunit alpha Cav1.1
Type:
PROTEIN
Mol. Mass.:
212348.33
Organism:
Homo sapiens (Human)
Description:
ChEMBL_42767
Residue:
1873
  
Component 4
Name:
Voltage-dependent L-type calcium channel subunit alpha-1F
Synonyms:
CAC1F_HUMAN CACNAF1 Voltage-gated calcium channel | Voltage-gated calcium channel subunit alpha Cav1.4
Type:
PROTEIN
Mol. Mass.:
220661.87
Organism:
Homo sapiens (Human)
Description:
ChEMBL_105734
Residue:
1977
  
Inhibitor
Name:
BDBM50095309
Synonyms:
CHEMBL3589557
Type:
Small organic molecule
Emp. Form.:
C20H21Cl2F2N3O3S
Mol. Mass.:
492.367
SMILES:
Cl.[H][C@]12CCCN1CCN(C2)C(=O)c1cc(c(F)cc1Cl)S(=O)(=O)Nc1ccccc1F
: