Target
Protein arginine N-methyltransferase 1 [11-371]
Ligand
BDBM50095441
Substrate
Meas. Tech.
ChEMBL_1504110 (CHEMBL3591484)
IC50
119±n/a nM
Citation
 Mitchell, LHDrew, AERibich, SARioux, NSwinger, KKJacques, SLLingaraj, TBoriack-Sjodin, PAWaters, NJWigle, TJMoradei, OJin, LRiera, TPorter-Scott, MMoyer, MPSmith, JJChesworth, RCopeland, RA Aryl Pyrazoles as Potent Inhibitors of Arginine Methyltransferases: Identification of the First PRMT6 Tool Compound. ACS Med Chem Lett 6:655-9 (2015)  
Target
Name:
Protein arginine N-methyltransferase 1 [11-371]
Synonyms:
ANM1_HUMAN HRMT1L2 PRMT1 Protein arginine methyltransferase 1 (PRMT1) | Protein-arginine N-methyltransferase 1
Type:
Protein
Mol. Mass.:
41506.52
Organism:
Homo sapiens (Human)
Description:
Q99873[11-371]
Residue:
361
  
Inhibitor
Name:
BDBM50095441
Synonyms:
CHEMBL3589039
Type:
Small organic molecule
Emp. Form.:
C25H38N4O3
Mol. Mass.:
442.5942
SMILES:
CNCCN(C)Cc1c[nH]nc1-c1ccc(O[C@H]2C[C@@H](C2)OCCC2CCOCC2)cc1
: