Target
5-hydroxytryptamine receptor 2A
Ligand
BDBM50097673
Substrate
Meas. Tech.
ChEMBL_1504500 (CHEMBL3590942)
EC50
10±n/a nM
Citation
 Hansen, MJacobsen, SEPlunkett, SLiebscher, GEMcCorvy, JDBräuner-Osborne, HKristensen, JL Synthesis and pharmacological evaluation of N-benzyl substituted 4-bromo-2,5-dimethoxyphenethylamines as 5-HT2A/2C partial agonists. Bioorg Med Chem 23:3933-7 (2015)  
Target
Name:
5-hydroxytryptamine receptor 2A
Synonyms:
5-HT-2 5-HT2A 5-hydroxytryptamine receptor 2A (5HT-2A) 5HT2A_HUMAN HTR2A | Serotonin receptor 2A
Type:
undefined
Mol. Mass.:
52607.65
Organism:
Homo sapiens (Human)
Description:
P28223
Residue:
471
  
Inhibitor
Name:
BDBM50097673
Synonyms:
CHEMBL3589578
Type:
Small organic molecule
Emp. Form.:
C18H20BrNO4
Mol. Mass.:
394.26
SMILES:
COc1cc(CCNCc2cccc3OCOc23)c(OC)cc1Br
: