Target
Coagulation factor VII/Tissue factor
Ligand
BDBM50098600
Substrate
Meas. Tech.
ChEMBL_1504782 (CHEMBL3595067)
Ki
8.0±n/a nM
Citation
 Priestley, ESCheney, DLDeLucca, IWei, ALuettgen, JMRendina, ARWong, PCWexler, RR Structure-Based Design of Macrocyclic Coagulation Factor VIIa Inhibitors. J Med Chem 58:6225-36 (2015)  
Target
Name:
Coagulation factor VII/Tissue factor
Synonyms:
Coagulation factor III/Factor VIIa (fVIIa) | Coagulation factor III/VII
Type:
Mol. Mass.:
Description:
ASSAY_ID of EBI is 69535
Components:
This complex has 2 components.
Component 1
Name:
Tissue factor
Synonyms:
CD_antigen=CD142 Coagulation factor VII/tissue factor TF Thromboplastin | Tissue factor
Type:
PROTEIN
Mol. Mass.:
33067.61
Organism:
Homo sapiens (Human)
Description:
ChEMBL_936735
Residue:
295
  
Component 2
Name:
Coagulation factor VII
Synonyms:
Eptacog alfa FA7_HUMAN Factor VIIa (fVIIa) SPCA serum prothrombin conversion accelerator
Type:
Enzyme
Mol. Mass.:
51599.89
Organism:
Homo sapiens (Human)
Description:
Residue:
466
  
Inhibitor
Name:
BDBM50098600
Synonyms:
CHEMBL3594315
Type:
Small organic molecule
Emp. Form.:
C32H35N5O4S
Mol. Mass.:
585.716
SMILES:
CC(C)S(=O)(=O)c1ccc(NC(C)=O)cc1[C@H]1CCCN1C(=O)[C@H](Nc1ccc2c(N)nccc2c1)c1ccccc1
: