Target
Carbonic anhydrase 2
Ligand
BDBM26985
Substrate
Meas. Tech.
ChEMBL_1446411 (CHEMBL3375525)
Ki
1510000±n/a nM
Citation
 Del Prete, SVullo, DFisher, GMAndrews, KTPoulsen, SACapasso, CSupuran, CT Discovery of a new family of carbonic anhydrases in the malaria pathogen Plasmodium falciparum--theż-carbonic anhydrases. Bioorg Med Chem Lett 24:4389-96 (2014)  
Target
Name:
Carbonic anhydrase 2
Synonyms:
CA-II CAC Carbonate dehydratase II Carbonic anhydrase 2 (CA-II) Carbonic anhydrase C Carbonic anhydrase II (CA-II) Carbonic anhydrase II (hCA II) | Carbonic anhydrase isoenzyme II (hCA II)
Type:
Enzyme
Mol. Mass.:
29250.71
Organism:
Homo sapiens (Human)
Description:
P00918
Residue:
260
  
Inhibitor
Name:
BDBM26985
Synonyms:
2-triaza-1,2-diyne CHEMBL89295 azide
Type:
Ion
Emp. Form.:
N3
Mol. Mass.:
42.0206
SMILES:
[N-]=[N+]=[N-]
: