Target
Proteasome subunit beta type-9
Ligand
BDBM50099945
Substrate
Meas. Tech.
ChEMBL_1446800 (CHEMBL3371274)
IC50
22±n/a nM
Citation
 de Bruin, GHuber, EMXin, BTvan Rooden, EJAl-Ayed, KKim, KBKisselev, AFDriessen, Cvan der Stelt, Mvan der Marel, GAGroll, MOverkleeft, HS Structure-based design of฿1i or฿5i specific inhibitors of human immunoproteasomes. J Med Chem 57:6197-209 (2014)  
Target
Name:
Proteasome subunit beta type-9
Synonyms:
LMP2 Macropain chain 7 PSB9_HUMAN PSMB9 Proteasome subunit beta-1i Really interesting new gene 12 protein
Type:
PROTEIN
Mol. Mass.:
23256.49
Organism:
Homo sapiens (Human)
Description:
ChEMBL_106197
Residue:
219
  
Inhibitor
Name:
BDBM50099945
Synonyms:
CHEMBL3319599
Type:
Small organic molecule
Emp. Form.:
C25H40FN7O6
Mol. Mass.:
553.6268
SMILES:
CCCC[C@H](NC(=O)[C@@H]1C[C@@H](F)CN1C(=O)[C@H](C)NC(=O)CN=[N+]=[N-])C(=O)N[C@@H](CC(C)C)C(=O)[C@@]1(C)CO1
: