Target
Proteasome subunit beta type-9
Ligand
BDBM50099954
Substrate
Meas. Tech.
ChEMBL_1446800 (CHEMBL3371274)
IC50
104±n/a nM
Citation
 de Bruin, GHuber, EMXin, BTvan Rooden, EJAl-Ayed, KKim, KBKisselev, AFDriessen, Cvan der Stelt, Mvan der Marel, GAGroll, MOverkleeft, HS Structure-based design of฿1i or฿5i specific inhibitors of human immunoproteasomes. J Med Chem 57:6197-209 (2014)  
Target
Name:
Proteasome subunit beta type-9
Synonyms:
LMP2 Macropain chain 7 PSB9_HUMAN PSMB9 Proteasome subunit beta-1i Really interesting new gene 12 protein
Type:
PROTEIN
Mol. Mass.:
23256.49
Organism:
Homo sapiens (Human)
Description:
ChEMBL_106197
Residue:
219
  
Inhibitor
Name:
BDBM50099954
Synonyms:
CHEMBL3319605
Type:
Small organic molecule
Emp. Form.:
C25H48N2O5Si
Mol. Mass.:
484.7445
SMILES:
CCCCCCC(=O)N[C@@H](C)C(=O)N[C@@H](CC(C)C)C(=O)[C@@]1(CO[Si](C)(C)C(C)(C)C)CO1
: