Target
DNA-3-methyladenine glycosylase
Ligand
BDBM26658
Substrate
Meas. Tech.
ChEMBL_1463513 (CHEMBL3398695)
IC50
200000±n/a nM
Citation
 Dixon, MWoodrick, JGupta, SKarmahapatra, SKDevito, SVasudevan, SDakshanamurthy, SAdhikari, SYenugonda, VMRoy, R Naturally occurring polyphenol, morin hydrate, inhibits enzymatic activity of N-methylpurine DNA glycosylase, a DNA repair enzyme with various roles in human disease. Bioorg Med Chem 23:1102-11 (2015)  
Target
Name:
DNA-3-methyladenine glycosylase
Synonyms:
3-alkyladenine DNA glycosylase 3MG_HUMAN ADPG MID1 N-methylpurine-DNA glycosylase
Type:
PROTEIN
Mol. Mass.:
32883.92
Organism:
Homo sapiens (Human)
Description:
ChEMBL_109564
Residue:
298
  
Inhibitor
Name:
BDBM26658
Synonyms:
2-(2,4-dihydroxyphenyl)-3,5,7-trihydroxy-1-benzopyran-4-one 2-(2,4-dihydroxyphenyl)-3,5,7-trihydroxy-chromone 2-[2,4-bis(oxidanyl)phenyl]-3,5,7-tris(oxidanyl)chromen-4-one MLS000069618 Morin (5) SMR000058259 morin
Type:
Flavonoid
Emp. Form.:
C15H10O7
Mol. Mass.:
302.2357
SMILES:
Oc1ccc(c(O)c1)-c1oc2cc(O)cc(O)c2c(=O)c1O
: