Target
Solute carrier family 22 member 8
Ligand
BDBM50370584
Substrate
Meas. Tech.
ChEMBL_1482571 (CHEMBL3537392)
IC50
48600±n/a nM
Citation
 Wolman, ATGionfriddo, MRHeindel, GAMukhija, PWitkowski, SBommareddy, AVanwert, AL Organic anion transporter 3 interacts selectively with lipophilicß-lactam antibiotics. Drug Metab Dispos 41:791-800 (2013)  
Target
Name:
Solute carrier family 22 member 8
Synonyms:
Oat3 Organic anion transporter 3 Roct Slc22a8 mOat3
Type:
PROTEIN
Mol. Mass.:
59254.18
Organism:
Mus musculus
Description:
ChEMBL_104613
Residue:
537
  
Inhibitor
Name:
BDBM50370584
Synonyms:
Beepen-VK PENICILLIN V Penicillin Phenoxymethyl
Type:
Small organic molecule
Emp. Form.:
C16H18N2O5S
Mol. Mass.:
350.39
SMILES:
CC1(C)S[C@@H]2[C@H](NC(=O)COc3ccccc3)C(=O)N2[C@H]1C(O)=O
: