Target
Cytochrome P450 2C9
Ligand
BDBM50241293
Substrate
Meas. Tech.
ChEMBL_1493771 (CHEMBL3530854)
IC50
>30000±n/a nM
Citation
 Lee, CAJones, JPKatayama, JKaspera, RJiang, YFreiwald, SSmith, EWalker, GSTotah, RA Identifying a selective substrate and inhibitor pair for the evaluation of CYP2J2 activity. Drug Metab Dispos 40:943-51 (2012)  
Target
Name:
Cytochrome P450 2C9
Synonyms:
(R)-limonene 6-monooxygenase CP2C9_HUMAN CYP2C9 Cytochrome P450 2C9 (CYP2C9 ) P-450MP P450 PB-1 | S-mephenytoin 4-hydroxylase
Type:
Enzyme
Mol. Mass.:
55636.33
Organism:
Homo sapiens (Human)
Description:
P11712
Residue:
490
  
Inhibitor
Name:
BDBM50241293
Synonyms:
(5-Propylsulfanyl-1H-benzoimidazol-2-yl)-carbamic acid methyl ester Albenza SK&F-62979 methyl 6-(propylthio)-1H-benzo[d]imidazol-2-ylcarbamate
Type:
Small organic molecule
Emp. Form.:
C12H15N3O2S
Mol. Mass.:
265.331
SMILES:
CCCSc1ccc2nc(NC(=O)OC)[nH]c2c1
: