Target
Cytochrome P450 2J2
Ligand
BDBM50017674
Substrate
Meas. Tech.
ChEMBL_1485701 (CHEMBL3541093)
IC50
>50000±n/a nM
Citation
 Ren, SZeng, JMei, YZhang, JZYan, SFFei, JChen, L Discovery and characterization of novel, potent, and selective cytochrome P450 2J2 inhibitors. Drug Metab Dispos 41:60-71 (2012)  
Target
Name:
Cytochrome P450 2J2
Synonyms:
CP2J2_HUMAN | CYP2J2
Type:
Enzyme
Mol. Mass.:
57623.04
Organism:
Homo sapiens (Human)
Description:
P51589
Residue:
502
  
Inhibitor
Name:
BDBM50017674
Synonyms:
(2-Benzhydryloxy-ethyl)-dimethyl-amine 2-(diphenylmethoxy)-N,N-dimethylethanamine Beldin Benadryl CHEMBL657 DIPHENHYDRAMINE Diphen N-[2-(BENZHYDRYLOXY)ETHYL]-N,N-DIMETHYLAMINE US9138431, DIPHENHYDRAMINE (Benadryl) | US9333199, DIPHENHYDRAMINE (Benadryl)
Type:
Small organic molecule
Emp. Form.:
C17H21NO
Mol. Mass.:
255.3547
SMILES:
CN(C)CCOC(c1ccccc1)c1ccccc1
: