Target
Cytochrome P450 3A4
Ligand
BDBM85509
Substrate
Meas. Tech.
ChEMBL_1485703 (CHEMBL3541095)
IC50
32700±n/a nM
Citation
 Ren, SZeng, JMei, YZhang, JZYan, SFFei, JChen, L Discovery and characterization of novel, potent, and selective cytochrome P450 2J2 inhibitors. Drug Metab Dispos 41:60-71 (2012)  
Target
Name:
Cytochrome P450 3A4
Synonyms:
Albendazole monooxygenase CP3A4_HUMAN CYP3A4 CYPIIIA4 Cytochrome P450 3A4 (CYP3A4) Nifedipine oxidase Taurochenodeoxycholate 6-alpha-hydroxylase
Type:
Enzyme
Mol. Mass.:
57349.57
Organism:
Homo sapiens (Human)
Description:
Residue:
503
  
Inhibitor
Name:
BDBM85509
Synonyms:
CAS_55142-85-3 Ticlopidine
Type:
Small organic molecule
Emp. Form.:
C14H14ClNS
Mol. Mass.:
263.786
SMILES:
Clc1ccccc1CN1CCc2sccc2C1
: