Target
Albumin
Ligand
BDBM50003659
Substrate
Meas. Tech.
ChEMBL_1486769 (CHEMBL3534721)
Kd
103000±n/a nM
Citation
 Longhi, RCorbioli, SFontana, SVinco, FBraggio, SHelmdach, LSchiller, JBoriss, H Brain tissue binding of drugs: evaluation and validation of solid supported porcine brain membrane vesicles (TRANSIL) as a novel high-throughput method. Drug Metab Dispos 39:312-21 (2011)  
Target
Name:
Albumin
Synonyms:
ALBU_RAT Serum albumin
Type:
PROTEIN
Mol. Mass.:
68729.59
Organism:
Rattus norvegicus
Description:
ChEMBL_1486769
Residue:
608
  
Inhibitor
Name:
BDBM50003659
Synonyms:
5H-dibenzo[b,f]azepine-5-carboxamide CARBATROL DIBENZO[B,F]AZEPINE-5-CARBOXYLIC ACID AMIDE(CARBAMAZEPINE) EQUETRO TEGRETOL TERIL US9144538, Carbamazepine
Type:
Small organic molecule
Emp. Form.:
C15H12N2O
Mol. Mass.:
236.2686
SMILES:
NC(=O)N1c2ccccc2C=Cc2ccccc12
: