Target
Microtubule-associated protein tau
Ligand
BDBM50065315
Substrate
Meas. Tech.
ChEMBL_1505258 (CHEMBL3594883)
Ki
618±n/a nM
Citation
 Chu, WZhou, DGaba, VLiu, JLi, SPeng, XXu, JDhavale, DBagchi, DPd'Avignon, AShakerdge, NBBacskai, BJTu, ZKotzbauer, PTMach, RH Design, Synthesis, and Characterization of 3-(Benzylidene)indolin-2-one Derivatives as Ligands fora-Synuclein Fibrils. J Med Chem 58:6002-17 (2015)  
Target
Name:
Microtubule-associated protein tau
Synonyms:
MAPT MTBT1 Neurofibrillary tangle protein Paired helical filament-tau TAU_HUMAN | Tau Protein
Type:
Protein
Mol. Mass.:
78928.63
Organism:
Homo sapiens (Human)
Description:
P10636
Residue:
758
  
Inhibitor
Name:
BDBM50065315
Synonyms:
3-[1-(4-Dimethylamino-phenyl)-meth-(Z)-ylidene]-1-methyl-1,3-dihydro-indol-2-one | CHEMBL86921
Type:
Small organic molecule
Emp. Form.:
C18H18N2O
Mol. Mass.:
278.3483
SMILES:
CN(C)c1ccc(\C=C2/C(=O)N(C)c3ccccc23)cc1
: