Target
Steryl-sulfatase
Ligand
BDBM50108126
Substrate
Meas. Tech.
ChEMBL_1508417 (CHEMBL3602391)
IC50
8.0±n/a nM
Citation
 Mostafa, YAKralt, BRao, PPTaylor, SD A-ring substituted 17ß-arylsulfonamides of 17ß-aminoestra-1,3,5(10)-trien-3-ol as highly potent reversible inhibitors of steroid sulfatase. Bioorg Med Chem 23:5681-92 (2015)  
Target
Name:
Steryl-sulfatase
Synonyms:
ARSC1 Arylsulfatase C STS_HUMAN Steryl-sulfate sulfohydrolase
Type:
Enzyme
Mol. Mass.:
65503.66
Organism:
Homo sapiens (Human)
Description:
P08842
Residue:
583
  
Inhibitor
Name:
BDBM50108126
Synonyms:
CHEMBL3600586
Type:
Small organic molecule
Emp. Form.:
C28H36N2O5S
Mol. Mass.:
512.661
SMILES:
[H][C@@]12CC[C@H](NS(=O)(=O)c3ccc(cc3)C(C)(C)C)[C@@]1(C)CC[C@]1([H])c3ccc(O)c(c3CC[C@@]21[H])[N+]([O-])=O
: