Target
Transthyretin
Ligand
BDBM22971
Substrate
Meas. Tech.
ChEMBL_1508575 (CHEMBL3602658)
Kd
480±n/a nM
Citation
 Iakovleva, IBrännström, KNilsson, LGharibyan, ALBegum, AAnan, IWalfridsson, MSauer-Eriksson, AEOlofsson, A Enthalpic Forces Correlate with the Selectivity of Transthyretin-Stabilizing Ligands in Human Plasma. J Med Chem 58:6507-15 (2015)  
Target
Name:
Transthyretin
Synonyms:
ATTR Prealbumin TTHY_HUMAN Transthyretin (TTR)
Type:
Enzyme
Mol. Mass.:
15884.31
Organism:
Homo sapiens (Human)
Description:
P02766
Residue:
147
  
Inhibitor
Name:
BDBM22971
Synonyms:
2-[(2,6-dichloro-3-methylphenyl)amino]benzoic acid Meclofenamate US11337935, Compound Meclofenamic-acid | US20240002326, Compound Meclofenamic acid
Type:
Small organic molecule
Emp. Form.:
C14H11Cl2NO2
Mol. Mass.:
296.149
SMILES:
Cc1ccc(Cl)c(Nc2ccccc2C(O)=O)c1Cl
: