Target
Histone-lysine N-methyltransferase EZH2
Ligand
BDBM50110357
Substrate
Meas. Tech.
ChEMBL_1511673 (CHEMBL3607426)
IC50
3.0±n/a nM
Citation
 Gehling, VSVaswani, RGNasveschuk, CGDuplessis, MIyer, PBalasubramanian, SZhao, FGood, ACCampbell, RLee, CDakin, LACook, ASGagnon, AHarmange, JCAudia, JECummings, RTNormant, ETrojer, PAlbrecht, BK Discovery, design, and synthesis of indole-based EZH2 inhibitors. Bioorg Med Chem Lett 25:3644-9 (2015)  
Target
Name:
Histone-lysine N-methyltransferase EZH2
Synonyms:
ENX-1 EZH2_HUMAN Histone-lysine N-methyltransferase EZH2 Lysine N-methyltransferase 6
Type:
Protein
Mol. Mass.:
85367.84
Organism:
Homo sapiens (Human)
Description:
Q15910
Residue:
746
  
Inhibitor
Name:
BDBM50110357
Synonyms:
CHEMBL3605455
Type:
Small organic molecule
Emp. Form.:
C27H36N4O4S
Mol. Mass.:
512.664
SMILES:
CCS(=O)(=O)N1CCC(CC1)[C@@H](C)n1c(C)c(C(=O)NCc2c(C)cc(C)[nH]c2=O)c2ccccc12
: