Target
Progesterone receptor
Ligand
BDBM50110735
Substrate
Meas. Tech.
ChEMBL_1510386 (CHEMBL3607226)
Ki
5.5±n/a nM
Citation
 Luz, JGCarson, MWCondon, BClawson, DPustilnik, AKohlman, DTBarr, RJBean, JSDill, MJSindelar, DKMaletic, MCoghlan, MJ Indole Glucocorticoid Receptor Antagonists Active in a Model of Dyslipidemia Act via a Unique Association with an Agonist Binding Site. J Med Chem 58:6607-18 (2015)  
Target
Name:
Progesterone receptor
Synonyms:
NR3C3 PGR PRGR_HUMAN | progesterone
Type:
Protein
Mol. Mass.:
98979.52
Organism:
Homo sapiens (Human)
Description:
P06401
Residue:
933
  
Inhibitor
Name:
BDBM50110735
Synonyms:
CHEMBL3605932
Type:
Small organic molecule
Emp. Form.:
C15H13ClN2O2S
Mol. Mass.:
320.794
SMILES:
CS(=O)(=O)Nc1cccc2c(c[nH]c12)-c1cccc(Cl)c1
: