Target
Acetylcholinesterase
Ligand
BDBM50111776
Substrate
Meas. Tech.
ChEMBL_1510666 (CHEMBL3608117)
IC50
0.450000±n/a nM
Citation
 Otto, RPenzis, RGaube, FAdolph, OFöhr, KJWarncke, PRobaa, DAppenroth, DFleck, CEnzensperger, CLehmann, JWinckler, T Evaluation of Homobivalent Carbolines as Designed Multiple Ligands for the Treatment of Neurodegenerative Disorders. J Med Chem 58:6710-5 (2015)  
Target
Name:
Acetylcholinesterase
Synonyms:
ACES_ELEEL Acetylcholinesterase (EeAChE) | ache
Type:
Enzyme
Mol. Mass.:
71812.79
Organism:
Electrophorus electricus (Electric eel)
Description:
Residue:
633
  
Inhibitor
Name:
BDBM50111776
Synonyms:
CHEMBL3605361
Type:
Small organic molecule
Emp. Form.:
C33H38I2N4
Mol. Mass.:
744.4906
SMILES:
[I-].[I-].C[n+]1ccc2n(CCCCCCCCCn3c4ccccc4c4c[n+](C)ccc34)c3ccccc3c2c1
: