Target
Macrophage-stimulating protein receptor
Ligand
BDBM50317323
Substrate
Meas. Tech.
ChEMBL_1513320 (CHEMBL3611224)
IC50
10.0±n/a nM
Citation
 Raeppel, SLTherrien, ERaeppel, F Design and synthesis of constrained analogs of LCRF-0004 as potent RON tyrosine kinase inhibitors. Bioorg Med Chem Lett 25:3706-10 (2015)  
Target
Name:
Macrophage-stimulating protein receptor
Synonyms:
2.7.10.1 CDw136 MST1R Macrophage-stimulating protein receptor alpha chain PTK8 RON Tyrosine kinase receptor ron | p185-Ron
Type:
Protein
Mol. Mass.:
152270.76
Organism:
Homo sapiens (Human)
Description:
Q04912
Residue:
1400
  
Inhibitor
Name:
BDBM50317323
Synonyms:
CHEMBL1094718 | N-(3-fluoro-4-(2-(1-methyl-1H-imidazol-4-yl)thieno[3,2-b]pyridin-7-yloxy)phenyl)-1-phenyl-5-(trifluoromethyl)-1H-pyrazole-4-carboxamide
Type:
Small organic molecule
Emp. Form.:
C28H18F4N6O2S
Mol. Mass.:
578.54
SMILES:
Cn1cnc(c1)-c1cc2nccc(Oc3ccc(NC(=O)c4cnn(c4C(F)(F)F)-c4ccccc4)cc3F)c2s1
: