Target
Monoacylglycerol lipase ABHD6
Ligand
BDBM50118167
Substrate
Meas. Tech.
ChEMBL_1514730 (CHEMBL3614931)
IC50
44±n/a nM
Citation
 Patel, JZvan Bruchem, JLaitinen, TKaczor, AANavia-Paldanius, DParkkari, TSavinainen, JRLaitinen, JTNevalainen, TJ Revisiting 1,3,4-Oxadiazol-2-ones: Utilization in the Development of ABHD6 Inhibitors. Bioorg Med Chem 23:6335-45 (2015)  
Target
Name:
Monoacylglycerol lipase ABHD6
Synonyms:
2-arachidonoylglycerol hydrolase ABHD6_HUMAN Monoacylglycerol lipase ABHD6
Type:
PROTEIN
Mol. Mass.:
38341.83
Organism:
Homo sapiens (Human)
Description:
ChEMBL_105457
Residue:
337
  
Inhibitor
Name:
BDBM50118167
Synonyms:
CHEMBL3613671
Type:
Small organic molecule
Emp. Form.:
C16H26N4O3S
Mol. Mass.:
354.468
SMILES:
CN(C1CCCCCCC1)C(=O)Oc1nsnc1N1CCOCC1
: