Target
S-methyl-5'-thioadenosine phosphorylase
Ligand
BDBM22113
Substrate
Meas. Tech.
ChEMBL_1511511 (CHEMBL3606936)
Ki
0.078000±n/a nM
Citation
 Evans, GBCameron, SALuxenburger, AGuan, RSuarez, JThomas, KSchramm, VLTyler, PC Tight binding enantiomers of pre-clinical drug candidates. Bioorg Med Chem 23:5326-33 (2015)  
Target
Name:
S-methyl-5'-thioadenosine phosphorylase
Synonyms:
5'-Methylthioadenosine phosphorylase (MTAP) MTA phosphorylase MTAP_HUMAN Methylthioadenosine Phosphorylase (MTAP) | S-methyl-5 -thioadenosine phosphorylase
Type:
Enzyme
Mol. Mass.:
31239.23
Organism:
Homo sapiens (Human)
Description:
Residue:
283
  
Inhibitor
Name:
BDBM22113
Synonyms:
(3R,4S)-1-({4-amino-5H-pyrrolo[3,2-d]pyrimidin-7-yl}methyl)-4-[(methylsulfanyl)methyl]pyrrolidin-3-ol (3R,4S)-1-[(9-Deazaadenin-9-yl)methyl]-3-hydroxy-4-methylthiomethylpyrrolidine, 7 MT-DADMe-ImmA
Type:
Emp. Form.:
C13H19N5OS
Mol. Mass.:
293.388
SMILES:
CSC[C@H]1CN(Cc2c[nH]c3c(N)ncnc23)C[C@@H]1O
: