Target
Polyunsaturated fatty acid 5-lipoxygenase
Ligand
BDBM4375
Substrate
Meas. Tech.
ChEMBL_1515806 (CHEMBL3614568)
IC50
>10000±n/a nM
Citation
 De Lucia, DLucio, OMMusio, BBender, AListing, MDennhardt, SKoeberle, AGarscha, URizzo, RManfredini, SWerz, OLey, SV Design, synthesis and evaluation of semi-synthetic triazole-containing caffeic acid analogues as 5-lipoxygenase inhibitors. Eur J Med Chem 101:573-83 (2015)  
Target
Name:
Polyunsaturated fatty acid 5-lipoxygenase
Synonyms:
5-LO 5-Lipoxygenase (5-LO) 5-Lipoygenase ALOX5 LOG5 | LOX5_HUMAN
Type:
Enzyme
Mol. Mass.:
77972.74
Organism:
Homo sapiens (Human)
Description:
Recombinant protein was purified from E. coli lysate. After ammonium sulfate precipitation and subsequent steps, the supernatant (S100) was used for 5-LO activity assay.
Residue:
674
  
Inhibitor
Name:
BDBM4375
Synonyms:
(2E)-3-(3,4-dihydroxyphenyl)prop-2-enoic acid 3,4-Dihydroxycinnamate, XVII Caffeic acid cid_689043
Type:
Small organic molecule
Emp. Form.:
C9H8O4
Mol. Mass.:
180.1574
SMILES:
OC(=O)\C=C\c1ccc(O)c(O)c1
: