Target
Neutrophil elastase
Ligand
BDBM50120436
Substrate
Meas. Tech.
ChEMBL_1517852 (CHEMBL3620648)
IC50
<0.300000±n/a nM
Citation
 von Nussbaum, FLi, VM Neutrophil elastase inhibitors for the treatment of (cardio)pulmonary diseases: Into clinical testing with pre-adaptive pharmacophores. Bioorg Med Chem Lett 25:4370-81 (2015)  
Target
Name:
Neutrophil elastase
Synonyms:
Bone marrow serine protease Coagulation factor X ELANE Elastase HLE Leukocyte elastase Medullasin Neutrophil elastase (HNE) PMN elastase Trypsin
Type:
Enzyme
Mol. Mass.:
28532.38
Organism:
Homo sapiens (Human)
Description:
P08246
Residue:
267
  
Inhibitor
Name:
BDBM50120436
Synonyms:
CHEMBL3617972
Type:
Small organic molecule
Emp. Form.:
C21H15F3N4O3S
Mol. Mass.:
460.429
SMILES:
CC1=C(C#N)[C@H](NC(=O)N1c1cccc(c1)C(F)(F)F)c1ccc(cc1S(C)(=O)=O)C#N
: