Target
Tyrosinase
Ligand
BDBM50120800
Substrate
Meas. Tech.
ChEMBL_1518633 (CHEMBL3619576)
IC50
1980±n/a nM
Citation
 Iwadate, TNihei, K Rhododendrol glycosides as stereospecific tyrosinase inhibitors. Bioorg Med Chem 23:6650-8 (2015)  
Target
Name:
Tyrosinase
Synonyms:
LB24-AB SK29-AB TYRO_HUMAN | Tumor rejection antigen AB
Type:
Protein
Mol. Mass.:
60388.08
Organism:
Homo sapiens (Human)
Description:
P14679
Residue:
529
  
Inhibitor
Name:
BDBM50120800
Synonyms:
CHEMBL3618460
Type:
Small organic molecule
Emp. Form.:
C22H34O13
Mol. Mass.:
506.4976
SMILES:
[H][C@]1(O[C@@H]2[C@@H](CO)O[C@@H](O[C@H](C)CCc3ccc(O)cc3O)[C@H](O)[C@H]2O)O[C@H](CO)[C@@H](O)[C@H](O)[C@H]1O
: