Target
Adenosine receptor A2a
Ligand
BDBM21190
Substrate
Meas. Tech.
ChEMBL_1518644 (CHEMBL3619587)
Ki
1.4±n/a nM
Citation
 Van der Walt, MMTerre'Blanche, G 1,3,7-Triethyl-substituted xanthines--possess nanomolar affinity for the adenosine A1 receptor. Bioorg Med Chem 23:6641-9 (2015)  
Target
Name:
Adenosine receptor A2a
Synonyms:
AA2AR_RAT Adenosine A2 receptor Adenosine Receptors A2a (A2a) Adenosine receptors A2a Rat striatal adenosine A2a receptor
Type:
G Protein-Coupled Receptor (GPCR)
Mol. Mass.:
45015.65
Organism:
Rattus norvegicus (rat)
Description:
Rat A2A receptors expressed in CHO cells.
Residue:
410
  
Inhibitor
Name:
BDBM21190
Synonyms:
4-(2-{[5-amino-2-(furan-2-yl)-[1,2,4]triazolo[1,5-a][1,3,5]triazin-7-yl]amino}ethyl)phenol ZM 241385 [3H]-ZM241385
Type:
Small organic molecule
Emp. Form.:
C16H15N7O2
Mol. Mass.:
337.336
SMILES:
Nc1nc(NCCc2ccc(O)cc2)nc2nc(nn12)-c1ccco1
: