Target
Pancreatic alpha-amylase
Ligand
BDBM50120841
Substrate
Meas. Tech.
ChEMBL_1516329 (CHEMBL3618921)
Ki
<10000000±n/a nM
Citation
 Al-Asri, JFazekas, ELehoczki, GPerdih, AGörick, CMelzig, MFGyémánt, GWolber, GMortier, J From carbohydrates to drug-like fragments: Rational development of novela-amylase inhibitors. Bioorg Med Chem 23:6725-32 (2015)  
Target
Name:
Pancreatic alpha-amylase
Synonyms:
1,4-alpha-D-glucan glucanohydrolase AMYP_PIG Pancreatic α-amylase
Type:
Protein
Mol. Mass.:
57088.07
Organism:
Sus scrofa (Pig)
Description:
P00690
Residue:
511
  
Inhibitor
Name:
BDBM50120841
Synonyms:
CHEMBL3616593
Type:
Small organic molecule
Emp. Form.:
C9H19NO9S
Mol. Mass.:
317.313
SMILES:
OC[C@H](OS(O)(=O)=O)[C@@H](O)CN1C[C@@H](O)[C@H](O)[C@H]1CO
: