Target
Polymerase acidic protein
Ligand
BDBM50122445
Substrate
Meas. Tech.
ChEMBL_1519446 (CHEMBL3625380)
IC50
>500000±n/a nM
Citation
 Pala, NStevaert, ADallocchio, RDessė, ARogolino, DCarcelli, MSanna, VSechi, MNaesens, L Virtual Screening and Biological Validation of Novel Influenza Virus PA Endonuclease Inhibitors. ACS Med Chem Lett 6:866-71 (2015)  
Target
Name:
Polymerase acidic protein
Synonyms:
PA Polymerase acidic protein | RNA-directed RNA polymerase subunit P2
Type:
PROTEIN
Mol. Mass.:
82546.82
Organism:
Influenza A virus (strain A/X-31 H3N2)
Description:
ChEMBL_109885
Residue:
716
  
Inhibitor
Name:
BDBM50122445
Synonyms:
CHEMBL463072
Type:
Small organic molecule
Emp. Form.:
C14H15NO5
Mol. Mass.:
277.2726
SMILES:
CCOC(=O)c1c(O)c2cc(OC)ccc2n(C)c1=O
: