Target
Branched-chain-amino-acid aminotransferase, mitochondrial
Ligand
BDBM50122753
Substrate
Meas. Tech.
ChEMBL_1520076 (CHEMBL3625417)
IC50
>100000±n/a nM
Citation
 Deng, HZhou, JSundersingh, FSSummerfield, JSomers, DMesser, JASatz, ALAncellin, NArico-Muendel, CCSargent Bedard, KLBeljean, ABelyanskaya, SLBingham, RSmith, SEBoursier, ECarter, PCentrella, PAClark, MAChung, CWDavie, CPDelorey, JLDing, YFranklin, GJGrady, LCHerry, KHobbs, CKollmann, CSMorgan, BAPothier Kaushansky, LJZhou, Q Discovery, SAR, and X-ray Binding Mode Study of BCATm Inhibitors from a Novel DNA-Encoded Library. ACS Med Chem Lett 6:919-24 (2015)  
Target
Name:
Branched-chain-amino-acid aminotransferase, mitochondrial
Synonyms:
BCAT(m) BCAT2_HUMAN BCATM Branched-chain-amino-acid aminotransferase, mitochondrial PP18 | Placental protein 18
Type:
PROTEIN
Mol. Mass.:
44297.81
Organism:
Homo sapiens (Human)
Description:
ChEMBL_109874
Residue:
392
  
Inhibitor
Name:
BDBM50122753
Synonyms:
CHEMBL3623141
Type:
Small organic molecule
Emp. Form.:
C26H24BrN3O5
Mol. Mass.:
538.39
SMILES:
CNC(=O)c1ccc(cc1OC1CCN(C1)C(=O)c1cc(Br)ccc1N)-c1cccc(c1)C(O)=O
: