Target
Acid-sensing ion channel 5
Ligand
BDBM50124575
Substrate
Meas. Tech.
ChEMBL_1520854 (CHEMBL3626239)
EC50
1400000±n/a nM
Citation
 Hendriks, CMPenning, TMZang, TWiemuth, DGründer, SSanhueza, IASchoenebeck, FBolm, C Pentafluorosulfanyl-containing flufenamic acid analogs: Syntheses, properties and biological activities. Bioorg Med Chem Lett 25:4437-40 (2015)  
Target
Name:
Acid-sensing ion channel 5
Synonyms:
ASIC5_RAT Accn5 Amiloride-sensitive cation channel 5 Blinac | Brain-liver-intestine amiloride-sensitive Na(+) channel
Type:
PROTEIN
Mol. Mass.:
56474.87
Organism:
Rattus norvegicus
Description:
ChEMBL_109894
Residue:
495
  
Inhibitor
Name:
BDBM50124575
Synonyms:
CHEMBL3623735
Type:
Small organic molecule
Emp. Form.:
C13H10F5NO2S
Mol. Mass.:
339.281
SMILES:
OC(=O)c1ccccc1Nc1cccc(c1)S(F)(F)(F)(F)F
: