Target
Kynurenine/alpha-aminoadipate aminotransferase, mitochondrial
Ligand
BDBM50126149
Substrate
Meas. Tech.
ChEMBL_1523468 (CHEMBL3630812)
IC50
13400±n/a nM
Citation
 Dounay, ABTuttle, JBVerhoest, PR Challenges and Opportunities in the Discovery of New Therapeutics Targeting the Kynurenine Pathway. J Med Chem 58:8762-82 (2015)  
Target
Name:
Kynurenine/alpha-aminoadipate aminotransferase, mitochondrial
Synonyms:
AADAT_RAT Kat2 | Kynurenine/alpha-aminoadipate aminotransferase
Type:
PROTEIN
Mol. Mass.:
47788.12
Organism:
Rattus norvegicus
Description:
ChEMBL_826599
Residue:
425
  
Inhibitor
Name:
BDBM50126149
Synonyms:
CHEMBL3629573
Type:
Small organic molecule
Emp. Form.:
C21H16N2O3S
Mol. Mass.:
376.428
SMILES:
O=C1NC(=O)\C(S1)=C\c1cccc(c1)-c1ccc2CCN3c2c1CCC3=O
: