Target
Metallo-beta-lactamase VIM-2
Ligand
BDBM50129062
Substrate
Meas. Tech.
ChEMBL_1523075 (CHEMBL3631652)
Kd
12000±n/a nM
Citation
 Christopeit, TCarlsen, TJHelland, RLeiros, HK Discovery of Novel Inhibitor Scaffolds against the Metallo-ß-lactamase VIM-2 by Surface Plasmon Resonance (SPR) Based Fragment Screening. J Med Chem 58:8671-82 (2015)  
Target
Name:
Metallo-beta-lactamase VIM-2
Synonyms:
Beta-lactamase VIM-2 | Metallo-beta-lactamase VIM-2 (VIM-2)
Type:
Protein
Mol. Mass.:
28318.00
Organism:
Pseudomonas aeruginosa (g-Proteobacteria)
Description:
Residue:
266
  
Inhibitor
Name:
BDBM50129062
Synonyms:
CHEBI:43968 Meropenem Merrem iv | SM-7338
Type:
Small organic molecule
Emp. Form.:
C17H25N3O5S
Mol. Mass.:
383.463
SMILES:
[H][C@]1([C@@H](C)O)C(=O)N2C(C(O)=O)=C(S[C@@H]3CN[C@@H](C3)C(=O)N(C)C)[C@H](C)[C@]12[H]
: