Target
Beta-secretase 1
Ligand
BDBM50129284
Substrate
Meas. Tech.
ChEMBL_1523399 (CHEMBL3630426)
pH
6.4±n/a
Ki
3400±n/a nM
Comments
extracted
Citation
 Boy, KMGuernon, JMWu, YJZhang, YShi, JZhai, WZhu, SGerritz, SWToyn, JHMeredith, JEBarten, DMBurton, CRAlbright, CFGood, ACGrace, JELentz, KAOlson, REMacor, JEThompson, LA Macrocyclic prolinyl acyl guanidines as inhibitors of฿-secretase (BACE). Bioorg Med Chem Lett 25:5040-7 (2015)  
Target
Name:
Beta-secretase 1
Synonyms:
ASP2 Aspartyl protease 2 BACE1 Beta-secretase (BACE) Beta-secretase 1 (BACE 1) Beta-secretase 1 (BACE1) Beta-site amyloid precursor protein cleaving enzyme 1 Memapsin-2 beta-Secretase (BACE-1) | beta-Secretase (BACE1)
Type:
Protein
Mol. Mass.:
55755.10
Organism:
Homo sapiens (Human)
Description:
P56817
Residue:
501
  
Inhibitor
Name:
BDBM50129284
Synonyms:
CHEMBL3627965
Type:
Small organic molecule
Emp. Form.:
C22H25Cl2N5O2
Mol. Mass.:
462.372
SMILES:
CC(=O)Nc1c(Cl)cc(CN\C(N)=N\C(=O)[C@@H]2CCCN2c2ccc(C)cc2)cc1Cl
: