Target
Carbonic anhydrase 12
Ligand
BDBM23409
Substrate
Meas. Tech.
ChEMBL_1523548 (CHEMBL3631196)
Ki
220±n/a nM
Citation
 Karioti, ACeruso, MCarta, FBilia, ARSupuran, CT New natural product carbonic anhydrase inhibitors incorporating phenol moieties. Bioorg Med Chem 23:7219-25 (2015)  
Target
Name:
Carbonic anhydrase 12
Synonyms:
CA-XII CAH12_HUMAN Carbonic anhydrase Carbonic anhydrase XII Carbonic anhydrase XII (CAXII) | Tumor antigen HOM-RCC-3.1.3
Type:
Enzyme
Mol. Mass.:
39456.00
Organism:
Homo sapiens (Human)
Description:
Catalytic domain of human cloned isozyme was used in the assay
Residue:
354
  
Inhibitor
Name:
BDBM23409
Synonyms:
3,5,7-trihydroxy-2-(4-hydroxy-3-methoxyphenyl)-4H-chromen-4-one Isorhamnetin | Isorhamnetin (17)
Type:
flavonol
Emp. Form.:
C16H12O7
Mol. Mass.:
316.2623
SMILES:
COc1cc(ccc1O)-c1oc2cc(O)cc(O)c2c(=O)c1O
: